Build Problem NHD2

ch@os_73
Registrierte Benutzer
Registrierte Benutzer
Beiträge: 2
Registriert: So 15. Dez 2013, 12:20

Re: Build Problem NHD2

#121

Beitrag von ch@os_73 » Fr 23. Jan 2015, 12:46

Hello ,

trying to build Neutrino HD2-exp for hs7810a, the build ends successfully but no HDMI output on the first start.

second question , is there any softcam manager to install on the build ? i'm using oscam .

Regards

Benutzeravatar
BPanther
Administrator
Administrator
Beiträge: 10792
Registriert: Do 11. Jan 2007, 00:06
Wohnort: Berlin
Hat sich bedankt: 192 Mal
Danksagung erhalten: 298 Mal
Kontaktdaten:

Re: Build Problem NHD2

#122

Beitrag von BPanther » Sa 24. Jan 2015, 00:25

No, that's not a part of neutrino itself. If you build by yourself just add a own created menu or use the examples from dbox2 neutrino etc.
MfG BPanther
KEIN SUPPORT PER PN -> Bitte das Forum nutzen und das Wiki lesen.


Bild Bild
Thx udog für das Bild.
TV: Sony Bravia KDL-46HX755, Sony Bravia KDL-40W4500 (old)
Boxen mit NMP: 7x UFS910 (128MB), UFS912, 2x UFS913, AV700, AV7000, AV7500 (DVB-S/C/T), Edision Argus Pingulux, Vizyon820HD,
3x AX 4K HD51 (DVB-S/SX/C/T/T2), VU+DUO, VU+Solo4K (DVB-S/SX (FBC)/C/T/T2 (DUAL)), VU+Duo4K (DVB-S/SX (FBC)/C (FBC)),
VU+Ultimo4K (DVB-S/SX (FBC)/C (DUAL)), VU+Uno4KSE (DVB-S/SX (FBC)/C (FBC)), 2xVU+Zero4K (DVB-S/SX)

ch@os_73
Registrierte Benutzer
Registrierte Benutzer
Beiträge: 2
Registriert: So 15. Dez 2013, 12:20

Re: Build Problem NHD2

#123

Beitrag von ch@os_73 » Sa 24. Jan 2015, 10:51

thanks "BPanther" for reply , i guess this is for the second question ; and regarding the hdmi output problem how to solve it ? may be you could direct me to what part of the code I should check.

Regards

Benutzeravatar
BPanther
Administrator
Administrator
Beiträge: 10792
Registriert: Do 11. Jan 2007, 00:06
Wohnort: Berlin
Hat sich bedankt: 192 Mal
Danksagung erhalten: 298 Mal
Kontaktdaten:

Re: Build Problem NHD2

#124

Beitrag von BPanther » Mo 26. Jan 2015, 00:07

I don't know this box and the problem. Maybe you can show the sources at libcoolstream (nhd2 directory) and player2 (main git).
MfG BPanther
KEIN SUPPORT PER PN -> Bitte das Forum nutzen und das Wiki lesen.


Bild Bild
Thx udog für das Bild.
TV: Sony Bravia KDL-46HX755, Sony Bravia KDL-40W4500 (old)
Boxen mit NMP: 7x UFS910 (128MB), UFS912, 2x UFS913, AV700, AV7000, AV7500 (DVB-S/C/T), Edision Argus Pingulux, Vizyon820HD,
3x AX 4K HD51 (DVB-S/SX/C/T/T2), VU+DUO, VU+Solo4K (DVB-S/SX (FBC)/C/T/T2 (DUAL)), VU+Duo4K (DVB-S/SX (FBC)/C (FBC)),
VU+Ultimo4K (DVB-S/SX (FBC)/C (DUAL)), VU+Uno4KSE (DVB-S/SX (FBC)/C (FBC)), 2xVU+Zero4K (DVB-S/SX)

slizer
Registrierte Benutzer
Registrierte Benutzer
Beiträge: 440
Registriert: Do 9. Mai 2013, 17:19

Re: Build Problem NHD2

#125

Beitrag von slizer » Di 21. Jul 2015, 23:42

Code: Alles auswählen

 mv -f .deps/upnpbrowser.Tpo .deps/upnpbrowser.Po
sh4-linux-g++ -DHAVE_CONFIG_H -I. -I../.. -I../../src -I../../src/zapit/include/zapit -I../../lib -I../../lib/libeventserver -I../../lib/libnet -I../../lib/libconfigfile -I../../lib/libxmltree -I../../lib/libupnpclient -I/home/slizer/max-tdt/tdt/tufsbox/cdkroot/usr/include -I/usr/include/freetype2  -I../../lib/libdvbapi -I../../lib/libeplayer3/include -fno-strict-aliasing -I/home/slizer/max-tdt/tdt/cvs/driver/bpamem    -pipe -Os -MT cam_menu.o -MD -MP -MF .deps/cam_menu.Tpo -c -o cam_menu.o cam_menu.cpp
cam_menu.cpp: In Elementfunktion »int CCAMMenuHandler::doMainMenu()«:
cam_menu.cpp:103:20: Fehler: »GenericMenuBack« wurde in diesem Gültigkeitsbereich nicht definiert
  cammenu->addItem( GenericMenuBack );
                    ^
cam_menu.cpp:104:20: Fehler: »GenericMenuSeparatorLine« wurde in diesem Gültigkeitsbereich nicht definiert
  cammenu->addItem( GenericMenuSeparatorLine );
                    ^
cam_menu.cpp:117:25: Fehler: expected type-specifier before »CMenuForwarderNonLocalized«
    cammenu->addItem(new CMenuForwarderNonLocalized(name, true, NULL, this, CAM, CRCInput::RC_nokey));
                         ^
cam_menu.cpp:123:25: Fehler: expected type-specifier before »CMenuForwarderNonLocalized«
    cammenu->addItem(new CMenuForwarderNonLocalized(str, false, NULL, tempMenu));
                         ^
cam_menu.cpp: In Elementfunktion »int CCAMMenuHandler::handleCamMsg(neutrino_msg_t, neutrino_msg_data_t, bool)«:
cam_menu.cpp:263:25: Fehler: expected type-specifier before »CMenuForwarderNonLocalized«
       menu->addItem(new CMenuForwarderNonLocalized(convertDVBUTF8(sptr, strlen(sptr), 0).c_str(), false));
                         ^
cam_menu.cpp:272:24: Fehler: expected type-specifier before »CMenuForwarderNonLocalized«
      menu->addItem(new CMenuForwarderNonLocalized(convertDVBUTF8(sptr, strlen(sptr), 0).c_str(), false));
                        ^
cam_menu.cpp:280:24: Fehler: expected type-specifier before »CMenuForwarderNonLocalized«
      menu->addItem(new CMenuForwarderNonLocalized(convertDVBUTF8(pMenu->choice_item[i], strlen(pMenu->choice_item[i]), 0).c_str(), true, NULL, selector, cnt));
                        ^
cam_menu.cpp:282:24: Fehler: expected type-specifier before »CMenuForwarderNonLocalized«
      menu->addItem(new CMenuForwarderNonLocalized(convertDVBUTF8(pMenu->choice_item[i], strlen(pMenu->choice_item[i]), 0).c_str(), true, NULL, selector, cnt, CRCInput::convertDigitToKey(i+1)));
                        ^
cam_menu.cpp:290:23: Fehler: expected type-specifier before »CMenuForwarderNonLocalized«
     menu->addItem(new CMenuForwarderNonLocalized(convertDVBUTF8(pMenu->bottom, slen, 0).c_str(), false));
                       ^
make[6]: *** [cam_menu.o] Fehler 1
make[6]: Verlasse Verzeichnis '/home/slizer/max-tdt/tdt/cvs/apps/nhd2-exp/src/gui'
make[5]: *** [all-recursive] Fehler 1
make[5]: Verlasse Verzeichnis '/home/slizer/max-tdt/tdt/cvs/apps/nhd2-exp/src/gui'
make[4]: *** [all] Fehler 2
make[4]: Verlasse Verzeichnis '/home/slizer/max-tdt/tdt/cvs/apps/nhd2-exp/src/gui'
make[3]: *** [all-recursive] Fehler 1
make[3]: Verlasse Verzeichnis '/home/slizer/max-tdt/tdt/cvs/apps/nhd2-exp/src'
make[2]: *** [all-recursive] Fehler 1
make[2]: Verlasse Verzeichnis '/home/slizer/max-tdt/tdt/cvs/apps/nhd2-exp'
make[1]: *** [all] Fehler 2
make[1]: Verlasse Verzeichnis '/home/slizer/max-tdt/tdt/cvs/apps/nhd2-exp'
make: *** [.deps/neutrino-hd2-exp.do_compile] Fehler 2
 

slizer
Registrierte Benutzer
Registrierte Benutzer
Beiträge: 440
Registriert: Do 9. Mai 2013, 17:19

Re: Build Problem NHD2

#126

Beitrag von slizer » Mo 3. Aug 2015, 11:09

ich habe mal das nglcd ins makefile genommen

Code: Alles auswählen

 C -o .libs/nglcd_la-glcdsetup.o
In file included from ../../nhd2-exp/src/gui/moviebrowser.h:78:0,
                 from ../../nhd2-exp/src/gui/movieplayer.h:43,
                 from ../../nhd2-exp/src/plugin.h:120,
                 from ./glcdsetup.h:29,
                 from glcdsetup.cpp:23:
../../nhd2-exp/src/gui/widget/listframe.h:144:31: warning: deprecated conversion from string constant to 'char*' [-Wwrite-strings]
   bool setTitle(char* title = "", const std::string& icon = NULL);
                               ^
glcdsetup.cpp: In member function 'virtual int GLCD_Menu::exec(CMenuTarget*, const string&)':
glcdsetup.cpp:233:86: error: 'ShowHintUTF' was not declared in this scope
     ShowHintUTF(LOCALE_MESSAGEBOX_INFO, "Einstellungen werden gespeichert !", 450, 2 );
                                                                                      ^
glcdsetup.cpp:235:85: error: 'ShowHintUTF' was not declared in this scope
     ShowHintUTF(LOCALE_MESSAGEBOX_INFO, "Einstellungen NICHT gespeichert !", 450, 2 );
                                                                                     ^
glcdsetup.cpp: In member function 'void GLCD_Menu::GLCD_Menu_Settings()':
glcdsetup.cpp:306:13: error: 'GenericMenuSeparatorLine' was not declared in this scope
  m->addItem(GenericMenuSeparatorLine);
             ^
make[3]: *** [nglcd_la-glcdsetup.lo] Fehler 1
make[3]: Verlasse Verzeichnis '/home/slizer/max-tdt/tdt/cvs/apps/nhd2-plugins/nglcd'
make[2]: *** [all-recursive] Fehler 1
make[2]: Verlasse Verzeichnis '/home/slizer/max-tdt/tdt/cvs/apps/nhd2-plugins'
make[1]: *** [all] Fehler 2
make[1]: Verlasse Verzeichnis '/home/slizer/max-tdt/tdt/cvs/apps/nhd2-plugins'
make: *** [.deps/nhd2-plugins.do_compile] Fehler 2 

Benutzeravatar
DboxOldie
Co-Admin
Co-Admin
Beiträge: 5199
Registriert: Sa 6. Aug 2011, 15:21
Hat sich bedankt: 52 Mal
Danksagung erhalten: 180 Mal

Re: Build Problem NHD2

#127

Beitrag von DboxOldie » Mo 3. Aug 2015, 11:34

Änder mal:

Code: Alles auswählen

ShowHintUTF(...
zu:

Code: Alles auswählen

HintBox(...
und:

Code: Alles auswählen

m->addItem(GenericMenuSeparatorLine);
zu:

Code: Alles auswählen

m->addItem(new CMenuSeparator(CMenuSeparator::LINE));
MfG DboxOldie

KEIN SUPPORT PER PN > Bitte das Forum benutzen und ins Wiki schauen

Bild

slizer
Registrierte Benutzer
Registrierte Benutzer
Beiträge: 440
Registriert: Do 9. Mai 2013, 17:19

Re: Build Problem NHD2

#128

Beitrag von slizer » Mo 3. Aug 2015, 12:01

ich werde es testen , heute , aber etwas später , danke

Benutzeravatar
DboxOldie
Co-Admin
Co-Admin
Beiträge: 5199
Registriert: Sa 6. Aug 2011, 15:21
Hat sich bedankt: 52 Mal
Danksagung erhalten: 180 Mal

Re: Build Problem NHD2

#129

Beitrag von DboxOldie » Mo 3. Aug 2015, 13:50

Mhh...
baut durch wenn auch noch -lusb durch -lusb-1.0 ersetzt wird ( beim DDT-Git )
Gibt allerdings einen Segfault beim Neutrino Start > das Plugin gelöscht > startet alles normal.
Da ist noch was faul...
MfG DboxOldie

KEIN SUPPORT PER PN > Bitte das Forum benutzen und ins Wiki schauen

Bild

slizer
Registrierte Benutzer
Registrierte Benutzer
Beiträge: 440
Registriert: Do 9. Mai 2013, 17:19

Re: Build Problem NHD2

#130

Beitrag von slizer » Mo 3. Aug 2015, 19:42

r2603

hab es getestet , musste Zeile 315 und 318 auch noch anpassen , damit es durchgebaut hat

die Box startet aber nicht mit dem plugin , im log kommt nach loadplugins ein Segfault

Antworten

Zurück zu „NHD2 - Allgemeines“